Ник:
Пароль:

Контакты

Cтатус Skype: starterkit.ru
тел.: (+7 3412) 478-448
тел.: +7 922 680-21-73
тел.: +7 922 680-21-74
E-mail: info@starterkit.ru
Партнеры:
otladka.com.ua - г.Киев

Способы оплаты

User Info


Добро пожаловать,
Guest

Регистрация или входРегистрация или вход
Потеряли пароль?Потеряли пароль?

Ник:
Пароль:

ПользователейПользователей:3
Поисковых ботовПоисковых ботов:2
ГостейГостей:1

ОбновитьПодробнееВсегоВсего:6
Форум » starterkit.ru » Embedded Linux
Полная сборка buildroot imxx6sk_qt5gst_defconfig не проходит
Wad1970
Добавлено 01.09.2020 12:58 Редактировалось 01.09.2020 13:01
0
Сообщение: 1
Wad1970
5

Пункты: 3447
Регистрация: 24.11.2014
kernel-module-imx-gpu-viv-a05d9b23b9902f6ce87d23772de2fdb2ecfb37a7.tar.gz has wrong sha256 hash:

для imx6q пробовал

....

Извините что создал отдельную тему... перепутал - хотел в Buildroot 2017 сообщение написать.
Спуститься к концу Подняться к началу
Персональная информация
sasamy
Добавлено 01.09.2020 15:42 Сообщение: 2
sasamy
4.84

Пункты: 56607
Регистрация: 14.08.2009
Цитата
kernel-module-imx-gpu-viv-a05d9b23b9902f6ce87d23772de2fdb2ecfb37a7.tar.gz has wrong sha256 hash:


http://www.starterkit.ru/html/index.php?name=forum&op=view&id=28554&last#29874
Спуститься к концу Подняться к началу
Персональная информация
Wad1970
Добавлено 01.09.2020 16:23 Сообщение: 3
Wad1970
5

Пункты: 3447
Регистрация: 24.11.2014
спасибо. дальше пошло.
Спуститься к концу Подняться к началу
Персональная информация
Wad1970
Добавлено 02.09.2020 08:09 Сообщение: 4
Wad1970
5

Пункты: 3447
Регистрация: 24.11.2014
Оставил установку на ночь.. Утром Vmware в числе запущеных не оказалась.
После включения и запуска make для buildroot выдает такое:

make[6]: Nothing to be done for 'first'.
cd calqlatr/ && ( test -e Makefile || /home/user/Projects/buildroot-2017.08-sk/output/host/bin/qmake -o Makefile /home/user/Projects/buildroot-2017.08-sk/output/build/qt5declarative-5.9.1/examples/quick/demos/calqlatr/calqlatr.pro ) && /usr/bin/make -f Makefile
make[6]: *** No targets. Stop.
Makefile:77: recipe for target 'sub-calqlatr-make_first' failed
make[5]: *** [sub-calqlatr-make_first] Error 2
Makefile:698: recipe for target 'sub-demos-make_first' failed
make[4]: *** [sub-demos-make_first] Error 2
make[4]: *** Waiting for unfinished jobs....
cd emitters/ && ( test -e Makefile || /home/user/Projects/buildroot-2017.08-sk/output/host/bin/qmake -o Makefile /home/user/Projects/buildroot-2017.08-sk/output/build/qt5declarative-5.9.1/examples/quick/particles/emitters/emitters.pro ) && /usr/bin/make -f Makefile
make[6]: *** No targets. Stop.
Makefile:98: recipe for target 'sub-emitters-make_first' failed
make[5]: *** [sub-emitters-make_first] Error 2
make[5]: *** Waiting for unfinished jobs....
make[6]: Nothing to be done for 'first'.
Makefile:673: recipe for target 'sub-particles-make_first' failed
make[4]: *** [sub-particles-make_first] Error 2
Makefile:96: recipe for target 'sub-quick-make_first' failed
make[3]: *** [sub-quick-make_first] Error 2
Makefile:98: recipe for target 'sub-examples-make_first' failed
make[2]: *** [sub-examples-make_first] Error 2
package/pkg-generic.mk:227: recipe for target '/home/user/Projects/buildroot-2017.08-sk/output/build/qt5declarative-5.9.1/.stamp_built' failed
make[1]: *** [/home/user/Projects/buildroot-2017.08-sk/output/build/qt5declarative-5.9.1/.stamp_built] Error 2
Makefile:79: recipe for target '_all' failed
make: *** [_all] Error 2
Спуститься к концу Подняться к началу
Персональная информация
Wad1970
Добавлено 02.09.2020 10:42 Сообщение: 5
Wad1970
5

Пункты: 3447
Регистрация: 24.11.2014
Делать ли make clean и по новой.. или не поможет?
Спуститься к концу Подняться к началу
Персональная информация
sasamy
Добавлено 02.09.2020 10:48 Редактировалось 02.09.2020 10:56 Сообщение: 6
sasamy
4.84

Пункты: 56607
Регистрация: 14.08.2009
Цитата
Утром Vmware в числе запущеных не оказалась.


в виртуальной машине какая версия убунты ? Точно собирается на 14.04. Посмотрите в терминале

$ lsb_release -a

эта версия была в материалах к платам там где buildroot 2014 с ядром 3.10.17. Возможно памяти на диске у виртуалки не хватает - по логу не видно.
Спуститься к концу Подняться к началу
Персональная информация
Wad1970
Добавлено 02.09.2020 11:11 Редактировалось 02.09.2020 11:12 Сообщение: 7
Wad1970
5

Пункты: 3447
Регистрация: 24.11.2014
user@ubuntu:~/Projects/buildroot-2017.08-sk$ lsb_release -a
No LSB modules are available.
Distributor ID: Ubuntu
Description: Ubuntu 16.04.1 LTS
Release: 16.04
Codename: xenial


Я поставил конфиг. imxx6sk_qt5gst_defconfig как в 3.10.17

но это отдельная вирт.машина... Просто нашел готовую на OTLADKA.COM с установленным ядром 4.1.15... думал так быстрее будет.

3.10.17 у меня стоит в ubuntu 14.. в другой виртуалке
А что лучше в ней было все делать?

Подскажите пожалуйста как теперь лучше сделать?
Спуститься к концу Подняться к началу
Персональная информация
sasamy
Добавлено 02.09.2020 12:12 Сообщение: 8
sasamy
4.84

Пункты: 56607
Регистрация: 14.08.2009
Цитата

3.10.17 у меня стоит в ubuntu 14.. в другой виртуалке
А что лучше в ней было все делать?


в ней должно собраться, по крайеней мере многократно протестировано
Спуститься к концу Подняться к началу
Персональная информация
Wad1970
Добавлено 03.09.2020 12:18 Редактировалось 03.09.2020 12:19 Сообщение: 9
Wad1970
5

Пункты: 3447
Регистрация: 24.11.2014
В ней собралось И настроена 14 удобно... И привычно
Спуститься к концу Подняться к началу
Персональная информация
Wad1970
Добавлено 07.09.2020 09:07 Сообщение: 10
Wad1970
5

Пункты: 3447
Регистрация: 24.11.2014
При создании каждого нового проекта так пишет
/home/user/src/buildroot-2017.08-sk/output/host/mkspecs/features/toolchain.prf(50): system(execute) requires one or two arguments. Project ERROR: Cannot run compiler '/home/user/src/buildroot-2017.08-sk/output/host/bin/arm-linux-gnueabihf-g++'. Maybe you forgot to setup the environment? Ошибка разбора файла /home/user/src/Campus/wce-gles-w2-gribochki/imxGLESv2.pro. Отмена.

После попытки компиляции и перезапуска qt уже не жалуется - начинает нормально работать.
'/home/user/src/buildroot-2017.08-sk/output/host/bin/arm-linux-gnueabihf-g++' присутствует..
А в Qt mkspec : devices/linux-buildroot-g++ почему то не прописывается.
После OK повторно заходишь и там пусто.
Спуститься к концу Подняться к началу
Персональная информация
Форум » starterkit.ru » Embedded Linux